Reaction Details
TargetGlutamate receptor ionotropic, NMDA 1
LigandBDBM50038043
Substrate/Competitorn/a
Meas. Tech.ChEBML_140321
Ki 9.9±n/a nM
Citation Nagata, RKodo, TYamaguchi, HTanno, N Structure-activity relationships of tricyclic quinoxalinediones as potent antagonists for the glycine binding site of the NMDA receptor 2 Bioorg Med Chem Lett5:1533-1536 (1995)    Article
 
Glutamate receptor ionotropic, NMDA 1
Name:Glutamate receptor ionotropic, NMDA 1
Type:Enzyme Catalytic Domain
Mol. Mass.:105533.40
Organism:RAT
Description:P35439
Residue:938
BDBM50038043
NameBDBM50038043
Synonyms:(9-Bromo-2,3-dioxo-2,3,6,7-tetrahydro-1H,5H-pyrido[1,2,3-de]quinoxalin-5-yl)-acetic acid | CHEMBL290555
TypeSmall organic molecule
Emp. Form.C13H11BrN2O4
Mol. Mass.339.141
SMILESOC(=O)CC1CCc2cc(Br)cc3[nH]c(=O)c(=O)n1c23