Reaction Details
TargetDihydroorotate dehydrogenase (quinone), mitochondrial
LigandBDBM50284830
Substrate/Competitorn/a
Meas. Tech.ChEBML_54063
Ki 24±n/a nM
Citation Batt, DGCopeland, RADowling, RLGardner, TLJones, EAOrwat, MJPinto, DJPitts, WJMagolda, RLJaffee, BD Immunosuppressive structure-activity relationships of Brequinar and related cinchoninic acid derivatives Bioorg Med Chem Lett5:1549-1554 (1995)    Article
 
Dihydroorotate dehydrogenase (quinone), mitochondrial
Name:Dihydroorotate dehydrogenase (quinone), mitochondrial
Type:Enzyme
Mol. Mass.:42881.33
Organism:Homo sapiens (Human)
Description:Q02127
Residue:395
BDBM50284830
NameBDBM50284830
Synonyms:CHEMBL38421 | Sodium; 6-fluoro-3-methyl-2-(4'-methyl-biphenyl-4-yl)-quinoline-4-carboxylate
TypeSmall organic molecule
Emp. Form.C24H17FNO2
Mol. Mass.370.3962
SMILESCc1ccc(cc1)-c1ccc(cc1)-c1nc2ccc(F)cc2c(C([O-])=O)c1C