Reaction Details
TargetDihydroorotate dehydrogenase (quinone), mitochondrial
LigandBDBM50284843
Substrate/Competitorn/a
Meas. Tech.ChEBML_54063
Ki 8.4±n/a nM
Citation Batt, DGCopeland, RADowling, RLGardner, TLJones, EAOrwat, MJPinto, DJPitts, WJMagolda, RLJaffee, BD Immunosuppressive structure-activity relationships of Brequinar and related cinchoninic acid derivatives Bioorg Med Chem Lett5:1549-1554 (1995)    Article
 
Dihydroorotate dehydrogenase (quinone), mitochondrial
Name:Dihydroorotate dehydrogenase (quinone), mitochondrial
Type:Enzyme
Mol. Mass.:42881.33
Organism:Homo sapiens (Human)
Description:Q02127
Residue:395
BDBM50284843
NameBDBM50284843
Synonyms:2-Biphenyl-4-yl-3-methyl-6-trifluoromethyl-quinoline-4-carboxylic acid | CHEMBL38692
TypeSmall organic molecule
Emp. Form.C24H16F3NO2
Mol. Mass.407.3845
SMILESCc1c(nc2ccc(cc2c1C(O)=O)C(F)(F)F)-c1ccc(cc1)-c1ccccc1