Reaction Details
TargetDihydroorotate dehydrogenase (quinone), mitochondrial
LigandBDBM50201921
Substrate/Competitorn/a
Meas. Tech.ChEBML_54063
Ki 40±n/a nM
Citation Batt, DGCopeland, RADowling, RLGardner, TLJones, EAOrwat, MJPinto, DJPitts, WJMagolda, RLJaffee, BD Immunosuppressive structure-activity relationships of Brequinar and related cinchoninic acid derivatives Bioorg Med Chem Lett5:1549-1554 (1995)    Article
 
Dihydroorotate dehydrogenase (quinone), mitochondrial
Name:Dihydroorotate dehydrogenase (quinone), mitochondrial
Type:Enzyme
Mol. Mass.:42881.33
Organism:Homo sapiens (Human)
Description:Q02127
Residue:395
BDBM50201921
NameBDBM50201921
Synonyms:2-Biphenyl-4-yl-6-fluoro-3-hydroxy-quinoline-4-carboxylic acid | CHEMBL41719
TypeSmall organic molecule
Emp. Form.C22H14FNO3
Mol. Mass.359.3499
SMILESOC(=O)c1c(O)c(nc2ccc(F)cc12)-c1ccc(cc1)-c1ccccc1