Reaction Details
TargetSterol O-acyltransferase 1
LigandBDBM50284874
Substrate/Competitorn/a
Meas. Tech.ChEMBL_28006 (CHEMBL642889)
IC50 63±n/a nM
Citation Chiari, AFancelli, DLovisolo, PPRadice, ASavoia, LSeverino, DGhiselli, G Synthesis and pharmacological profile of FCE 28654: A water-soluble and injectable ACAT inhibitor Bioorg Med Chem Lett5:1581-1586 (1995)    Article
 
Sterol O-acyltransferase 1
Name:Sterol O-acyltransferase 1
Type:Multi-pass membrane protein may form homo- or heterodimers.
Mol. Mass.:64751.94
Organism:Homo sapiens (Human)
Description:P35610
Residue:550
BDBM50284874
NameBDBM50284874
Synonyms:1-(2,6-Diisopropyl-phenyl)-3-((4R,5R)-4,5-dimethyl-2-phenyl-[1,3]dioxolan-2-ylmethyl)-urea | CHEMBL40685
TypeSmall organic molecule
Emp. Form.C25H34N2O3
Mol. Mass.410.5491
SMILESCC(C)c1cccc(C(C)C)c1NC(=O)NCC1(O[C@H](C)[C@@H](C)O1)c1ccccc1