Reaction Details
TargetCysteinyl leukotriene receptor 1
LigandBDBM50284902
Substrate/Competitorn/a
Meas. Tech.ChEMBL_98639 (CHEMBL711839)
IC50 0.600000±n/a nM
Citation Lau, CKDufresne, CGareau, YZamboni, RLabelle, MYoung, RNMetters, KMRochette, CSawyer, NSlipetz, DMCharette, LJones, TMcAuliffe, MMcFarlane, CFord-Hutchinson, AW Evolution of a series of non-quinoline leukotriene D4 receptor antagonist; synthesis and sar of benzothiazoles and thiazoles substituted benzyl alcohols as potent LTD4 antagonists Bioorg Med Chem Lett5:1615-1620 (1995)    Article
 
Cysteinyl leukotriene receptor 1
Name:Cysteinyl leukotriene receptor 1
Type:Enzyme Catalytic Domain
Mol. Mass.:39007.58
Organism:GUINEA PIG
Description:Leukotriene D4 0 GUINEA PIG::Q2NNR5
Residue:340
BDBM50284902
NameBDBM50284902
Synonyms:(1-{(R)-1-{3-[(E)-2-(4-Cyclobutyl-thiazol-2-yl)-vinyl]-phenyl}-3-[2-(1-hydroxy-1-methyl-ethyl)-phenyl]-propylsulfanylmethyl}-cyclopropyl)-acetic acid | CHEMBL416251
TypeSmall organic molecule
Emp. Form.C33H39NO3S2
Mol. Mass.561.798
SMILESCC(C)(O)c1ccccc1CC[C@@H](SCC1(CC(O)=O)CC1)c1cccc(\C=C\c2nc(cs2)C2CCC2)c1