Reaction Details
TargetThromboxane A2 receptor
LigandBDBM50403475
Substrate/Competitorn/a
Meas. Tech.ChEBML_209594
Kd 424±n/a nM
Citation Prakash, CSaleh, SMurray, RFltzGerald, GABlair, IA Synthesis of a fluorescent labeled thromboxane A2 receptor antagonist Bioorg Med Chem Lett5:1653-1656 (1995)    Article
 
Thromboxane A2 receptor
Name:Thromboxane A2 receptor
Type:Enyzme
Mol. Mass.:37445.28
Organism:Homo sapiens (Human)
Description:P21731
Residue:343
BDBM50403475
NameBDBM50403475
Synonyms:CHEMBL2114959
TypeSmall organic molecule
Emp. Form.C19H22O2
Mol. Mass.282.3768
SMILESCC1(C)C2CC1[C@H](Cc1cccc3ccc(=O)oc13)CC2