Reaction Details
TargetGag-Pol polyprotein [489-587]
LigandBDBM50284916
Substrate/Competitorn/a
Meas. Tech.ChEBML_79465
Ki 8±n/a nM
Citation Randad, RSLubkowska, LBhat, TNMunshi, SGulnik, SVYu, BErickson, JW Symmetry-based HIV Protease inhibitors: rational design of 2-methylbenzamides as novel P2/P2′ ligands Bioorg Med Chem Lett5:1707-1712 (1995)    Article
 
Gag-Pol polyprotein [489-587]
Name:Gag-Pol polyprotein [489-587]
Type:Enzyme Subunit
Mol. Mass.:10781.16
Organism:Human immunodeficiency virus type 1
Description:P04585[489-587]
Residue:99
BDBM50284916
NameBDBM50284916
Synonyms:1N-[1-benzyl-2,3-dihydroxy-4-(2-methylphenylcarboxamido)-5-phenyl-(1S,2R,3S,4S)-pentyl]-2-methylbenzamide | CHEMBL47551
TypeSmall organic molecule
Emp. Form.C34H36N2O4
Mol. Mass.536.6606
SMILESCc1ccccc1C(=O)N[C@@H](Cc1ccccc1)[C@@H](O)[C@@H](O)[C@H](Cc1ccccc1)NC(=O)c1ccccc1C