Reaction Details
TargetPapain
LigandBDBM50284944
Substrate/Competitorn/a
Meas. Tech.ChEBML_152660
Ki 574000±n/a nM
Citation Albeck, APersky, RKliper, S Design of a new selective cysteine protease inactivator and its mechanistic implications Bioorg Med Chem Lett5:1767-1772 (1995)    Article
 
Papain
Name:Papain
Type:Enzyme
Mol. Mass.:38923.01
Organism:Carica papaya
Description:Papain was purchased from Sigma, Germany.
Residue:345
BDBM50284944
NameBDBM50284944
Synonyms:((S)-1-(S)-Oxiranyl-2-phenyl-ethyl)-carbamic acid benzyl ester | CHEMBL298965
TypeSmall organic molecule
Emp. Form.C18H19NO3
Mol. Mass.297.3484
SMILESO=C(N[C@@H](Cc1ccccc1)[C@H]1CO1)OCc1ccccc1