Reaction Details
TargetReverse transcriptase/RNaseH
LigandBDBM50213275
Substrate/Competitorn/a
Meas. Tech.ChEMBL_80145 (CHEMBL856189)
IC50>100000±n/a nM
Citation Wagner, CRMcIntee, EJSchinazi, RFAbraham, TW Aromatic amino acid phosphoramidate di- and triesters of 3′-azido-3′-deoxythymidine (AZT) are non-toxic inhibitors of HIV-1 replication Bioorg Med Chem Lett5:1819-1824 (1995)    Article
 
Reverse transcriptase/RNaseH
Name:Reverse transcriptase/RNaseH
Type:PROTEIN
Mol. Mass.:65229.15
Organism:Human immunodeficiency virus 1
Description:ChEMBL_1473730
Residue:566
BDBM50213275
NameBDBM50213275
Synonyms:CHEMBL2021382
TypeSmall organic molecule
Emp. Form.C22H26N7O8P
Mol. Mass.547.4577
SMILESCOC(=O)[C@H](Cc1c[nH]c2ccccc12)NP(O)(=O)OC[C@H]1O[C@H](C[C@@H]1N=[N+]=[N-])n1cc(C)c(=O)[nH]c1=O