Reaction Details
TargetReverse transcriptase/RNaseH
LigandBDBM50060160
Substrate/Competitorn/a
Meas. Tech.ChEBML_80145
IC50>100000±n/a nM
Citation Wagner, CRMcIntee, EJSchinazi, RFAbraham, TW Aromatic amino acid phosphoramidate di- and triesters of 3′-azido-3′-deoxythymidine (AZT) are non-toxic inhibitors of HIV-1 replication Bioorg Med Chem Lett5:1819-1824 (1995)    Article
 
Reverse transcriptase/RNaseH
Name:Reverse transcriptase/RNaseH
Type:PROTEIN
Mol. Mass.:65229.15
Organism:Human immunodeficiency virus 1
Description:ChEMBL_1473730
Residue:566
BDBM50060160
NameBDBM50060160
Synonyms:(S)-2-[[3-Azido-5-(5-methyl-2,4-dioxo-3,4-dihydro-2H-pyrimidin-1-yl)-tetrahydro-furan-2-ylmethoxy]-(2-cyano-ethoxy)-phosphorylamino]-3-(1H-indol-3-yl)-propionic acid methyl ester | CHEMBL300454
TypeSmall organic molecule
Emp. Form.C25H29N8O8P
Mol. Mass.600.5203
SMILESCOC(=O)[C@H](Cc1c[nH]c2ccccc12)NP(=O)(OCCC#N)OCC1OC(CC1N=[N+]=[N-])n1cc(C)c(=O)[nH]c1=O