Reaction Details
TargetNitric oxide synthase, inducible
LigandBDBM7886
Substrate/Competitorn/a
Meas. Tech.ChEBML_89180
IC50 8000±n/a nM
Citation Ouazzani, JServy, CBloy, CDucrocq, C Fungal metabolite of naftazone inhibits nitrite production by activated murine macrophages Bioorg Med Chem Lett5:1825-1828 (1995)    Article
 
Nitric oxide synthase, inducible
Name:Nitric oxide synthase, inducible
Type:Enzyme
Mol. Mass.:130595.79
Organism:Mus musculus (mouse)
Description:Recombinant enzyme overexpressed in E. coli.
Residue:1144
BDBM7886
NameBDBM7886
Synonyms:1-PIM 1-phenylimidazole US9138393, 1-Phenyl- imidazole | US9144538, 1-Phenylimidazole
TypeSmall organic molecule
Emp. Form.C9H8N2
Mol. Mass.144.1732
SMILESc1cn(cn1)-c1ccccc1