Reaction Details
TargetGag-Pol polyprotein [489-587]
LigandBDBM50284984
Substrate/Competitorn/a
Meas. Tech.ChEBML_79474
Ki 16±n/a nM
Citation Park, CKoh, JSSon, YCChoi, HiLee, CSChoy, NMoon, KYJung, WHKim, SCYoon, H Rational design of irreversible, pseudo-C2-symmetric hiv-1 protease inhibitors Bioorg Med Chem Lett5:1843-1848 (1995)    Article
 
Gag-Pol polyprotein [489-587]
Name:Gag-Pol polyprotein [489-587]
Type:Enzyme Subunit
Mol. Mass.:10781.16
Organism:Human immunodeficiency virus type 1
Description:P04585[489-587]
Residue:99
BDBM50284984
NameBDBM50284984
Synonyms:(R)-3-Methyl-N-[(S)-1-((2R,3S)-3-{[(S)-3-methyl-2-(3-methyl-3-pyridin-2-ylmethyl-ureido)-butyrylamino]-methyl}-oxiranyl)-2-phenyl-ethyl]-2-(3-methyl-3-pyridin-2-ylmethyl-ureido)-butyramide | CHEMBL53328
TypeSmall organic molecule
Emp. Form.C37H50N8O5
Mol. Mass.686.8435
SMILESCC(C)[C@H](NC(=O)N(C)Cc1ccccn1)C(=O)NC[C@@H]1O[C@@H]1[C@H](Cc1ccccc1)NC(=O)[C@H](NC(=O)N(C)Cc1ccccn1)C(C)C