Reaction Details
TargetGag-Pol polyprotein [489-587]
LigandBDBM50284986
Substrate/Competitorn/a
Meas. Tech.ChEBML_79474
Ki 0.100000±n/a nM
Citation Park, CKoh, JSSon, YCChoi, HiLee, CSChoy, NMoon, KYJung, WHKim, SCYoon, H Rational design of irreversible, pseudo-C2-symmetric hiv-1 protease inhibitors Bioorg Med Chem Lett5:1843-1848 (1995)    Article
 
Gag-Pol polyprotein [489-587]
Name:Gag-Pol polyprotein [489-587]
Type:Enzyme Subunit
Mol. Mass.:10781.16
Organism:Human immunodeficiency virus type 1
Description:P04585[489-587]
Residue:99
BDBM50284986
NameBDBM50284986
Synonyms:CHEMBL55197 | [(R)-1-((S)-1-{(2R,3S)-3-[((S)-2-Benzyloxycarbonylamino-3-methyl-butyrylamino)-methyl]-oxiranyl}-2-phenyl-ethylcarbamoyl)-2-methyl-propyl]-carbamic acid benzyl ester
TypeSmall organic molecule
Emp. Form.C37H46N4O7
Mol. Mass.658.7837
SMILESCC(C)[C@H](NC(=O)OCc1ccccc1)C(=O)NC[C@@H]1O[C@@H]1[C@H](Cc1ccccc1)NC(=O)[C@H](NC(=O)OCc1ccccc1)C(C)C