Reaction Details
TargetGag-Pol polyprotein [489-587]
LigandBDBM50284991
Substrate/Competitorn/a
Meas. Tech.ChEBML_79474
Ki 75±n/a nM
Citation Park, CKoh, JSSon, YCChoi, HiLee, CSChoy, NMoon, KYJung, WHKim, SCYoon, H Rational design of irreversible, pseudo-C2-symmetric hiv-1 protease inhibitors Bioorg Med Chem Lett5:1843-1848 (1995)    Article
 
Gag-Pol polyprotein [489-587]
Name:Gag-Pol polyprotein [489-587]
Type:Enzyme Subunit
Mol. Mass.:10781.16
Organism:Human immunodeficiency virus type 1
Description:P04585[489-587]
Residue:99
BDBM50284991
NameBDBM50284991
Synonyms:CHEMBL295499 | [(S)-1-((S)-1-{3-[(S)-1-((S)-2-Benzyloxycarbonylamino-3-methyl-butyrylamino)-2-phenyl-ethyl]-oxiranyl}-2-phenyl-ethylcarbamoyl)-2-methyl-propyl]-carbamic acid benzyl ester
TypeSmall organic molecule
Emp. Form.C44H52N4O7
Mol. Mass.748.9063
SMILESCC(C)[C@H](NC(=O)OCc1ccccc1)C(=O)N[C@@H](Cc1ccccc1)C1OC1[C@H](Cc1ccccc1)NC(=O)[C@@H](NC(=O)OCc1ccccc1)C(C)C