Reaction Details
TargetGastrin/cholecystokinin type B receptor
LigandBDBM50285010
Substrate/Competitorn/a
Meas. Tech.ChEBML_40187
IC50 0.700000±n/a nM
Citation Lowe, JADrozda, SEMcLean, SBryce, DKCrawford, RTZorn, SMorrone, JAppleton, TALombardo, F A water soluble benzazepine cholecystokinin-B receptor antagonist Bioorg Med Chem Lett5:1933-1936 (1995)    Article
 
Gastrin/cholecystokinin type B receptor
Name:Gastrin/cholecystokinin type B receptor
Type:G Protein-Coupled Receptor (GPCR)
Mol. Mass.:48445.79
Organism:Homo sapiens (Human)
Description:Stable expression of human CCK-2 receptors in HEK 293 cells.
Residue:447
BDBM50285010
NameBDBM50285010
Synonyms:3-{3-[(3R,5R)-1-(tert-Butylcarbamoyl-methyl)-8-methyl-2-oxo-5-phenyl-2,3,4,5-tetrahydro-1H-benzo[b]azepin-3-yl]-ureido}-N-(1H-tetrazol-5-yl)-benzamide | CHEMBL58658
TypeSmall organic molecule
Emp. Form.C32H35N9O4
Mol. Mass.609.6782
SMILESCc1ccc2[C@H](C[C@@H](NC(=O)Nc3cccc(c3)C(=O)Nc3nnn[nH]3)C(=O)N(CC(=O)NC(C)(C)C)c2c1)c1ccccc1