Reaction Details
TargetGastrin/cholecystokinin type B receptor
LigandBDBM50285019
Substrate/Competitorn/a
Meas. Tech.ChEBML_40187
IC50 0.220000±n/a nM
Citation Lowe, JADrozda, SEMcLean, SBryce, DKCrawford, RTZorn, SMorrone, JAppleton, TALombardo, F A water soluble benzazepine cholecystokinin-B receptor antagonist Bioorg Med Chem Lett5:1933-1936 (1995)    Article
 
Gastrin/cholecystokinin type B receptor
Name:Gastrin/cholecystokinin type B receptor
Type:G Protein-Coupled Receptor (GPCR)
Mol. Mass.:48445.79
Organism:Homo sapiens (Human)
Description:Stable expression of human CCK-2 receptors in HEK 293 cells.
Residue:447
BDBM50285019
NameBDBM50285019
Synonyms:CHEMBL294161 | N-tert-Butyl-2-((3R,5R)-5-cyclohexyl-8-methyl-2-oxo-3-{3-[3-(1H-tetrazol-5-yl)-phenyl]-ureido}-2,3,4,5-tetrahydro-benzo[b]azepin-1-yl)-acetamide
TypeSmall organic molecule
Emp. Form.C31H40N8O3
Mol. Mass.572.7011
SMILESCc1ccc2[C@H](C[C@@H](NC(=O)Nc3cccc(c3)-c3nnn[nH]3)C(=O)N(CC(=O)NC(C)(C)C)c2c1)C1CCCCC1