Reaction Details
TargetcAMP-specific 3',5'-cyclic phosphodiesterase 4B
LigandBDBM50285053
Substrate/Competitorn/a
Meas. Tech.ChEBML_155171
Ki 1200±n/a nM
Citation Stafford, JAValvano, NLFeldman, PLBrawley, ESCowan, DJDomanico, PLLeesnitzer, MARose, DAStimpson, SAStrickland, ABUnwalla, RJVerghese, MW Phosphodiesterase type IV (PDE IV) inhibition. Synthesis and evaluation of a series of 1,3,4-trisubstituted pyrrolidines Bioorg Med Chem Lett5:1977-1982 (1995)    Article
 
cAMP-specific 3',5'-cyclic phosphodiesterase 4B
Name:cAMP-specific 3',5'-cyclic phosphodiesterase 4B
Type:Protein
Mol. Mass.:83318.87
Organism:Homo sapiens (Human)
Description:Q07343
Residue:736
BDBM50285053
NameBDBM50285053
Synonyms:1-(tert-butyl) 3-methyl 4-(3,4-dimethoxyphenyl)-(3S,4R)-tetrahydro-1H-1,3-pyrroledicarboxylate | CHEMBL60217
TypeSmall organic molecule
Emp. Form.C19H27NO6
Mol. Mass.365.4208
SMILESCOC(=O)[C@@H]1CN(C[C@H]1c1ccc(OC)c(OC)c1)C(=O)OC(C)(C)C