Reaction Details
TargetLeukotriene B4 receptor 1
LigandBDBM50280286
Substrate/Competitorn/a
Meas. Tech.ChEMBL_98502 (CHEMBL709164)
Ki 14±n/a nM
Citation Sofia, MJNelson, KHerron, DKGoodson, TFroelich, LLSpaethe, SMMarder, PRoman, CRFleisch, JH 2-alkyl-4-ethyl-5-[6-methyl-6-(2H-tetrazol-5-yl)heptyloxy]phenol leukotriene B4 receptor antagonists Bioorg Med Chem Lett5:1995-2000 (1995)    Article
 
Leukotriene B4 receptor 1
Name:Leukotriene B4 receptor 1
Type:Enzyme Catalytic Domain
Mol. Mass.:37582.68
Organism:Homo sapiens (Human)
Description:Q15722
Residue:352
BDBM50280286
NameBDBM50280286
Synonyms:4-ethyl-5-[6-methyl-6-(2H-1,2,3,4-tetraazol-5-yl)heptyloxy]-2-pentyloxyphenol; with sodium ion sodium 4-ethyl-5-[6-methyl-6-(2H-1,2,3,4-tetraazol-5-yl)heptyloxy]-2-pentyloxyphenol
TypeSmall organic molecule
Emp. Form.C22H35N4O3
Mol. Mass.403.5388
SMILESCCCCCOc1cc(CC)c(OCCCCCC(C)(C)c2nn[n-]n2)cc1O