Reaction Details
TargetProtein kinase C eta type
LigandBDBM50285088
Substrate/Competitorn/a
Meas. Tech.ChEBML_161133
IC50 20±n/a nM
Citation Jr., GEDefauw, JMLai, YSCrane, HMHall, SEBuben, JAHu, HGosnell, PA Novel PKC inhibitory analogs of balanol with replacement of the ester functionality Bioorg Med Chem Lett5:2015-2020 (1995)    Article
 
Protein kinase C eta type
Name:Protein kinase C eta type
Type:Enzyme
Mol. Mass.:77844.26
Organism:Homo sapiens (Human)
Description:The recombinant human PKC enzymes were produced using a baculovirus expression system in SF9 cells
Residue:683
BDBM50285088
NameBDBM50285088
Synonyms:4-(2-Carboxy-6-hydroxy-benzoyl)-3,5-dihydroxy-benzoic acid (R)-3-(4-hydroxy-benzoylamino)-4-methyl-azepan-4-yl ester | CHEMBL433101
TypeSmall organic molecule
Emp. Form.C29H28N2O10
Mol. Mass.564.54
SMILESC[C@]1(CCCNC[C@H]1NC(=O)c1ccc(O)cc1)OC(=O)c1cc(O)c(C(=O)c2c(O)cccc2C(O)=O)c(O)c1