Reaction Details
TargetProtein kinase C eta type
LigandBDBM3149
Substrate/Competitorn/a
Meas. Tech.ChEMBL_161133 (CHEMBL767401)
IC50 3±n/a nM
Citation Jr., GEDefauw, JMLai, YSCrane, HMHall, SEBuben, JAHu, HGosnell, PA Novel PKC inhibitory analogs of balanol with replacement of the ester functionality Bioorg Med Chem Lett5:2015-2020 (1995)    Article
 
Protein kinase C eta type
Name:Protein kinase C eta type
Type:Enzyme
Mol. Mass.:77844.26
Organism:Homo sapiens (Human)
Description:The recombinant human PKC enzymes were produced using a baculovirus expression system in SF9 cells
Residue:683
BDBM3149
NameBDBM3149
Synonyms:2-{[2,6-dihydroxy-4-({[(3R,4R)-3-[(4-hydroxybenzene)amido]azepan-4-yl]oxy}carbonyl)phenyl]carbonyl}-3-hydroxybenzoic acid Balanol analog 1 CHEMBL60254
TypeSmall organic molecule
Emp. Form.C28H26N2O10
Mol. Mass.550.5134
SMILESOC(=O)c1cccc(O)c1C(=O)c1c(O)cc(cc1O)C(=O)O[C@@H]1CCCNC[C@H]1NC(=O)c1ccc(O)cc1