Reaction Details
TargetProtein kinase C zeta type
LigandBDBM3152
Substrate/Competitorn/a
Meas. Tech.ChEBML_161467
IC50 6800±n/a nM
Citation Jr., GEDefauw, JMLai, YSCrane, HMHall, SEBuben, JAHu, HGosnell, PA Novel PKC inhibitory analogs of balanol with replacement of the ester functionality Bioorg Med Chem Lett5:2015-2020 (1995)    Article
 
Protein kinase C zeta type
Name:Protein kinase C zeta type
Type:Enzyme
Mol. Mass.:67649.13
Organism:Homo sapiens (Human)
Description:n/a
Residue:592
BDBM3152
NameBDBM3152
Synonyms:2-{[2,6-dihydroxy-4-({[(3R,4R)-4-[(4-hydroxybenzene)amido]pyrrolidin-3-yl]oxy}carbonyl)phenyl]carbonyl}-3-hydroxybenzoic acid CHEMBL59828
TypeSmall organic molecule
Emp. Form.C26H22N2O10
Mol. Mass.522.4603
SMILESOC(=O)c1cccc(O)c1C(=O)c1c(O)cc(cc1O)C(=O)O[C@@H]1CNC[C@H]1NC(=O)c1ccc(O)cc1