Reaction Details
TargetProtein kinase C delta type
LigandBDBM50285087
Substrate/Competitorn/a
Meas. Tech.ChEBML_160782
IC50 12±n/a nM
Citation Jr., GEDefauw, JMLai, YSCrane, HMHall, SEBuben, JAHu, HGosnell, PA Novel PKC inhibitory analogs of balanol with replacement of the ester functionality Bioorg Med Chem Lett5:2015-2020 (1995)    Article
 
Protein kinase C delta type
Name:Protein kinase C delta type
Type:Enzyme
Mol. Mass.:77516.79
Organism:Homo sapiens (Human)
Description:The recombinant human PKC enzymes were produced using a baculovirus expression system in SF9 cells
Residue:676
BDBM50285087
NameBDBM50285087
Synonyms:(R)-2-{2,6-Dihydroxy-4-[(3R,4R)-4-(4-hydroxy-benzoylamino)-pyrrolidin-3-ylcarbamoyl]-benzoyl}-3-hydroxy-benzoic acid | CHEMBL59677
TypeSmall organic molecule
Emp. Form.C26H23N3O9
Mol. Mass.521.4755
SMILESOC(=O)c1cccc(O)c1C(=O)c1c(O)cc(cc1O)C(=O)N[C@@H]1CNC[C@H]1NC(=O)c1ccc(O)cc1