Reaction Details
TargetProtein kinase C zeta type
LigandBDBM3153
Substrate/Competitorn/a
Meas. Tech.ChEBML_161467
IC50 22000±n/a nM
Citation Jr., GEDefauw, JMLai, YSCrane, HMHall, SEBuben, JAHu, HGosnell, PA Novel PKC inhibitory analogs of balanol with replacement of the ester functionality Bioorg Med Chem Lett5:2015-2020 (1995)    Article
 
Protein kinase C zeta type
Name:Protein kinase C zeta type
Type:Enzyme
Mol. Mass.:67649.13
Organism:Homo sapiens (Human)
Description:n/a
Residue:592
BDBM3153
NameBDBM3153
Synonyms:2-{[2,6-dihydroxy-4-({[(1R,2R)-2-[(4-hydroxybenzene)amido]cyclopentyl]oxy}carbonyl)phenyl]carbonyl}-3-hydroxybenzoic acid CHEMBL52529
TypeSmall organic molecule
Emp. Form.C27H23NO10
Mol. Mass.521.4722
SMILESOC(=O)c1cccc(O)c1C(=O)c1c(O)cc(cc1O)C(=O)O[C@@H]1CCC[C@H]1NC(=O)c1ccc(O)cc1