Reaction Details
TargetChymotrypsin-like elastase family member 2A
LigandBDBM50285107
Substrate/Competitorn/a
Meas. Tech.ChEMBL_154797 (CHEMBL761676)
IC50 490±n/a nM
Citation Boschetti, CEMata, EGMascaretti, OACricco, JACoux, GRoveri, OA Synthesis and porcine pancreatic elastase inhibitory evaluation of 6α-(sulfonyl)oxy-and 6α-chloropenicillanate sulfone esters and 3α-(acyloxy)methyl-6α-chloropenam sulfones Bioorg Med Chem Lett5:2033-2036 (1995)    Article
 
Chymotrypsin-like elastase family member 2A
Name:Chymotrypsin-like elastase family member 2A
Type:PROTEIN
Mol. Mass.:28705.23
Organism:Sus scrofa
Description:ChEMBL_156951
Residue:269
BDBM50285107
NameBDBM50285107
Synonyms:(2S,5R,6S)-3,3-Dimethyl-4,4,7-trioxo-6-(toluene-4-sulfonyloxy)-4lambda*6*-thia-1-aza-bicyclo[3.2.0]heptane-2-carboxylic acid 2,2-dimethyl-propionyloxymethyl ester | CHEMBL418507
TypeSmall organic molecule
Emp. Form.C21H27NO10S2
Mol. Mass.517.57
SMILESCc1ccc(cc1)S(=O)(=O)O[C@@H]1[C@@H]2N([C@@H](C(=O)OCOC(=O)C(C)(C)C)C(C)(C)S2(=O)=O)C1=O