Reaction Details
TargetDNA topoisomerase 1
LigandBDBM50285230
Substrate/Competitorn/a
Meas. Tech.ChEBML_208256
IC50 170±n/a nM
Citation Peel, MRMilstead, MWSternbach, DDBesterman, JMLeitner, PMorton, BWall, MEWani, MC Novel A-ring modified camptothecins as topoisomerase I inhibitors Bioorg Med Chem Lett5:2129-2132 (1995)    Article
 
DNA topoisomerase 1
Name:DNA topoisomerase 1
Type:Enzyme
Mol. Mass.:90771.02
Organism:Homo sapiens (Human)
Description:P11387
Residue:765
BDBM50285230
NameBDBM50285230
Synonyms:(S)-9-Amino-4-ethyl-4,8-dihydroxy-1,12-dihydro-4H-2-oxa-6,12a-diaza-dibenzo[b,h]fluorene-3,13-dione | CHEMBL67115
TypeSmall organic molecule
Emp. Form.C20H17N3O5
Mol. Mass.379.3661
SMILESCC[C@@]1(O)C(=O)OCc2c1cc1-c3nc4cc(O)c(N)cc4cc3Cn1c2=O