Reaction Details
TargetDNA topoisomerase 1
LigandBDBM50036133
Substrate/Competitorn/a
Meas. Tech.ChEBML_208256
IC50 30±n/a nM
Citation Peel, MRMilstead, MWSternbach, DDBesterman, JMLeitner, PMorton, BWall, MEWani, MC Novel A-ring modified camptothecins as topoisomerase I inhibitors Bioorg Med Chem Lett5:2129-2132 (1995)    Article
 
DNA topoisomerase 1
Name:DNA topoisomerase 1
Type:Enzyme
Mol. Mass.:90771.02
Organism:Homo sapiens (Human)
Description:P11387
Residue:765
BDBM50036133
NameBDBM50036133
Synonyms:7-ethyl-7-hydroxy-(7S)-7,8,11,13-tetrahydro-10H-[1,3]dioxolo[4,5-g]pyrano[3',4':6,7]indolizino[1,2-b]quinoline-8,11-dione CHEMBL307794
TypeSmall organic molecule
Emp. Form.C21H16N2O6
Mol. Mass.392.3615
SMILESCC[C@@]1(O)C(=O)OCc2c1cc1-c3nc4cc5OCOc5cc4cc3Cn1c2=O