Reaction Details
TargetProtein kinase C beta type
LigandBDBM50285233
Substrate/Competitorn/a
Meas. Tech.ChEMBL_160465 (CHEMBL761761)
IC50 2500±n/a nM
Citation Lai*, YSStamper, M Heteroatom effect in the PKC inhibitory activities of perhydroazepine analogs of balanol Bioorg Med Chem Lett5:2147-2150 (1995)    Article
 
Protein kinase C beta type
Name:Protein kinase C beta type
Type:Enzyme
Mol. Mass.:76873.67
Organism:Homo sapiens (Human)
Description:The recombinant human PKC enzymes were produced using a baculovirus expression system in SF9 cells
Residue:671
BDBM50285233
NameBDBM50285233
Synonyms:4-(2-Carboxy-6-hydroxy-benzoyl)-3,5-dihydroxy-benzoic acid (3S,4R)-3-(4-hydroxy-benzoylamino)-oxepan-4-yl ester | CHEMBL70078
TypeSmall organic molecule
Emp. Form.C28H25NO11
Mol. Mass.551.4982
SMILESOC(=O)c1cccc(O)c1C(=O)c1c(O)cc(cc1O)C(=O)O[C@@H]1CCCOC[C@@H]1NC(=O)c1ccc(O)cc1