Reaction Details
TargetProtein kinase C gamma type
LigandBDBM50285236
Substrate/Competitorn/a
Meas. Tech.ChEBML_161272
IC50 60±n/a nM
Citation Lai*, YSStamper, M Heteroatom effect in the PKC inhibitory activities of perhydroazepine analogs of balanol Bioorg Med Chem Lett5:2147-2150 (1995)    Article
 
Protein kinase C gamma type
Name:Protein kinase C gamma type
Type:Enzyme
Mol. Mass.:78458.05
Organism:Homo sapiens (Human)
Description:The recombinant human PKC enzymes were produced using a baculovirus expression system in SF9 cells
Residue:697
BDBM50285236
NameBDBM50285236
Synonyms:4-(2-Carboxy-6-hydroxy-benzoyl)-3,5-dihydroxy-benzoic acid (1R,2S)-2-(4-hydroxy-benzoylamino)-cycloheptyl ester | CHEMBL302998
TypeSmall organic molecule
Emp. Form.C29H27NO10
Mol. Mass.549.5254
SMILESOC(=O)c1cccc(O)c1C(=O)c1c(O)cc(cc1O)C(=O)O[C@@H]1CCCCC[C@@H]1NC(=O)c1ccc(O)cc1