Reaction Details
TargetNeutrophil elastase
LigandBDBM50285289
Substrate/Competitorn/a
Meas. Tech.ChEMBL_86286 (CHEMBL698901)
Ki 0.022±n/a nM
Citation Desai, RCDunlap, RPFarrell, RPFerguson, EFranke, CAGordon, RHlasta, DJTalomie, TG Alkoxy substituted benzisothiazolone (BIT) derivatives: potent inhibitors of human leukocyte elastase Bioorg Med Chem Lett5:105-109 (1995)    Article
 
Neutrophil elastase
Name:Neutrophil elastase
Type:Enzyme
Mol. Mass.:28532.38
Organism:Homo sapiens (Human)
Description:P08246
Residue:267
BDBM50285289
NameBDBM50285289
Synonyms:2,6-Dichloro-3-(2-morpholin-4-yl-ethoxy)-benzoic acid 4-ethoxy-6-methoxy-1,1,3-trioxo-1,3-dihydro-1lambda*6*-benzo[d]isothiazol-2-ylmethyl ester | CHEMBL12082
TypeSmall organic molecule
Emp. Form.C24H26Cl2N2O9S
Mol. Mass.589.442
SMILESCCOc1cc(OC)cc2c1C(=O)N(COC(=O)c1c(Cl)ccc(OCCN3CCOCC3)c1Cl)S2(=O)=O