Reaction Details
TargetNeutrophil elastase
LigandBDBM50285290
Substrate/Competitorn/a
Meas. Tech.ChEMBL_86286 (CHEMBL698901)
Ki 0.17±n/a nM
Citation Desai, RCDunlap, RPFarrell, RPFerguson, EFranke, CAGordon, RHlasta, DJTalomie, TG Alkoxy substituted benzisothiazolone (BIT) derivatives: potent inhibitors of human leukocyte elastase Bioorg Med Chem Lett5:105-109 (1995)    Article
 
Neutrophil elastase
Name:Neutrophil elastase
Type:Enzyme
Mol. Mass.:28532.38
Organism:Homo sapiens (Human)
Description:P08246
Residue:267
BDBM50285290
NameBDBM50285290
Synonyms:2,6-Dichloro-benzoic acid 4-ethoxy-1,1,3-trioxo-1,3-dihydro-1lambda*6*-benzo[d]isothiazol-2-ylmethyl ester | CHEMBL11758
TypeSmall organic molecule
Emp. Form.C17H13Cl2NO6S
Mol. Mass.430.259
SMILESCCOc1cccc2c1C(=O)N(COC(=O)c1c(Cl)cccc1Cl)S2(=O)=O