Reaction Details
TargetReverse transcriptase/RNaseH
LigandBDBM1518
Substrate/Competitorn/a
Meas. Tech.ChEBML_195359
IC50 125±n/a nM
Citation Proudfoot, JR The synthesis of a dipyrido[3,2-b:3′,4′-e][1,4]diazepinone: Convenient access to a C-ring isomer of the HIV-1 reverse transcriptase inhibitor nevirapine Bioorg Med Chem Lett5:163-166 (1995)    Article
 
Reverse transcriptase/RNaseH
Name:Reverse transcriptase/RNaseH
Type:PROTEIN
Mol. Mass.:65229.15
Organism:Human immunodeficiency virus 1
Description:ChEMBL_1473730
Residue:566
BDBM1518
NameBDBM1518
Synonyms:2-ethyl-9-methyl-2,4,9,15-tetraazatricyclo[9.4.0.0^{3,8}]pentadeca-1(11),3,5,7,12,14-hexaen-10-one Dipyridodiazepinone deriv. 3
TypeSmall organic molecule
Emp. Form.C14H14N4O
Mol. Mass.254.2872
SMILESCCN1c2ncccc2N(C)C(=O)c2cccnc12