Reaction Details
TargetSterol O-acyltransferase 1
LigandBDBM50285443
Substrate/Competitorn/a
Meas. Tech.ChEBML_28031
IC50 20±n/a nM
Citation Wilde, RGKlaczkiewicz, JDBillheimer, JTWexler, RRGillies, PJ Acyl CoA:cholesterol acyltransferase (ACAT) inhibitors: heterocyclic bioisosteres for the urea group in DuP 128 Bioorg Med Chem Lett5:177-180 (1995)    Article
 
Sterol O-acyltransferase 1
Name:Sterol O-acyltransferase 1
Type:PROTEIN
Mol. Mass.:63818.83
Organism:Mus musculus
Description:ChEMBL_90523
Residue:540
BDBM50285443
NameBDBM50285443
Synonyms:Benzooxazol-2-yl-[5-(4,5-diphenyl-1H-imidazol-2-ylsulfanyl)-pentyl]-heptyl-amine | CHEMBL53728
TypeSmall organic molecule
Emp. Form.C34H40N4OS
Mol. Mass.552.773
SMILESCCCCCCCN(CCCCCSc1nc(c([nH]1)-c1ccccc1)-c1ccccc1)c1nc2ccccc2o1