Reaction Details
Target5-hydroxytryptamine receptor 1A
LigandBDBM50285522
Substrate/Competitorn/a
Meas. Tech.ChEBML_1234
IC50 20±n/a nM
Citation Macor, JEBlank, DHDesai, KFox, CBKoe, BKLebel, LAPost, RJSchmidt, AWSchulz, DWSeymour, PA 5-cyano-1-[3-(N-methylpyrrolidin-2R-ylmethyl)indol-5-yl] benzimidazole (CP-161,242): A potent, centrally active 5-HT1D receptor agonist and benzodiazepine partial agonist Bioorg Med Chem Lett5:2391-2396 (1995)    Article
 
5-hydroxytryptamine receptor 1A
Name:5-hydroxytryptamine receptor 1A
Type:G Protein-Coupled Receptor (GPCR)
Mol. Mass.:46445.29
Organism:Rattus norvegicus (rat)
Description:Binding assays were performed using rat hippocampal membranes.
Residue:422
BDBM50285522
NameBDBM50285522
Synonyms:1-[3-((R)-1-Methyl-pyrrolidin-2-ylmethyl)-1H-indol-5-yl]-1H-benzoimidazole-5-carbonitrile CP-161242
TypeSmall organic molecule
Emp. Form.C22H21N5
Mol. Mass.355.4356
SMILESCN1CCC[C@@H]1Cc1c[nH]c2ccc(cc12)-n1cnc2cc(ccc12)C#N