Reaction Details
Target5-hydroxytryptamine receptor 1A
LigandBDBM50285523
Substrate/Competitorn/a
Meas. Tech.ChEBML_1234
IC50 210±n/a nM
Citation Macor, JEBlank, DHDesai, KFox, CBKoe, BKLebel, LAPost, RJSchmidt, AWSchulz, DWSeymour, PA 5-cyano-1-[3-(N-methylpyrrolidin-2R-ylmethyl)indol-5-yl] benzimidazole (CP-161,242): A potent, centrally active 5-HT1D receptor agonist and benzodiazepine partial agonist Bioorg Med Chem Lett5:2391-2396 (1995)    Article
 
5-hydroxytryptamine receptor 1A
Name:5-hydroxytryptamine receptor 1A
Type:G Protein-Coupled Receptor (GPCR)
Mol. Mass.:46445.29
Organism:Rattus norvegicus (rat)
Description:Binding assays were performed using rat hippocampal membranes.
Residue:422
BDBM50285523
NameBDBM50285523
Synonyms:CHEMBL80189 | [2-(5-Imidazo[4,5-b]pyridin-3-yl-1H-indol-3-yl)-ethyl]-dimethyl-amine
TypeSmall organic molecule
Emp. Form.C18H19N5
Mol. Mass.305.377
SMILESCN(C)CCc1c[nH]c2ccc(cc12)-n1cnc2cccnc12