Reaction Details
Target5-hydroxytryptamine receptor 1A
LigandBDBM10755
Substrate/Competitorn/a
Meas. Tech.ChEBML_591
EC50 43±n/a nM
Citation Macor, JEBlank, DHDesai, KFox, CBKoe, BKLebel, LAPost, RJSchmidt, AWSchulz, DWSeymour, PA 5-cyano-1-[3-(N-methylpyrrolidin-2R-ylmethyl)indol-5-yl] benzimidazole (CP-161,242): A potent, centrally active 5-HT1D receptor agonist and benzodiazepine partial agonist Bioorg Med Chem Lett5:2391-2396 (1995)    Article
 
5-hydroxytryptamine receptor 1A
Name:5-hydroxytryptamine receptor 1A
Type:n/a
Mol. Mass.:46122.49
Organism:Homo sapiens (Human)
Description:n/a
Residue:422
BDBM10755
NameBDBM10755
Synonyms:14C-5-hydroxy tryptamine creatinine disulfate 5-HT 5-hydroxy tryptamine creatinine disulfate Serotonin | [3H]-5-HT
TypeSmall organic molecule
Emp. Form.C10H12N2O
Mol. Mass.176.2151
SMILESNCCc1c[nH]c2ccc(O)cc12