Reaction Details
TargetStromelysin-1
LigandBDBM50285557
Substrate/Competitorn/a
Meas. Tech.ChEBML_101950
Ki 36±n/a nM
Citation Sahoo, SPCaldwell, CGChapman, KTDurette, PLEsser, CKKopka, IEPolo, SASperow, KMNiedzwiecki, LMIzquierdo-Martin, MChang, BCHarrison, RKStein, RLMacCoss, MHagmann, WK Inhibition of matrix metalloproteinases by N-carboxyalkyl dipeptides: Enhanced potency and selectivity with substituted P1′ homophenylalanines Bioorg Med Chem Lett5:2441-2446 (1995)    Article
 
Stromelysin-1
Name:Stromelysin-1
Type:Enzyme
Mol. Mass.:53973.13
Organism:Homo sapiens (Human)
Description: P08254
Residue:477
BDBM50285557
NameBDBM50285557
Synonyms:(R)-2-[(S)-3-(4-butyl-phenyl)-1-((S)-4-guanidino-1-phenylcarbamoyl-butylcarbamoyl)-propylamino]-propionic acid | CHEMBL249449
TypeSmall organic molecule
Emp. Form.C29H42N6O4
Mol. Mass.538.6816
SMILES[#6]-[#6]-[#6]-[#6]-c1ccc(-[#6]-[#6]-[#6@H](-[#7]-[#6@H](-[#6])-[#6](-[#8])=O)-[#6](=O)-[#7]-[#6@@H](-[#6]-[#6]-[#6]\[#7]=[#6](\[#7])-[#7])-[#6](=O)-[#7]-c2ccccc2)cc1