Reaction Details
Target72 kDa type IV collagenase
LigandBDBM50285566
Substrate/Competitorn/a
Meas. Tech.ChEBML_101914
Ki 220±n/a nM
Citation Sahoo, SPCaldwell, CGChapman, KTDurette, PLEsser, CKKopka, IEPolo, SASperow, KMNiedzwiecki, LMIzquierdo-Martin, MChang, BCHarrison, RKStein, RLMacCoss, MHagmann, WK Inhibition of matrix metalloproteinases by N-carboxyalkyl dipeptides: Enhanced potency and selectivity with substituted P1′ homophenylalanines Bioorg Med Chem Lett5:2441-2446 (1995)    Article
 
72 kDa type IV collagenase
Name:72 kDa type IV collagenase
Type:Enzyme
Mol. Mass.:73870.36
Organism:Homo sapiens (Human)
Description: P08253
Residue:660
BDBM50285566
NameBDBM50285566
Synonyms:(R)-2-((S)-4-(4-fluorophenyl)-1-((S)-4-methyl-1-oxo-1-(phenylamino)pentan-2-ylamino)-1-oxobutan-2-ylamino)propanoic acid CHEMBL310767
TypeSmall organic molecule
Emp. Form.C25H32FN3O4
Mol. Mass.457.5377
SMILESCC(C)C[C@H](NC(=O)[C@H](CCc1ccc(F)cc1)N[C@H](C)C(O)=O)C(=O)Nc1ccccc1