Reaction Details
TargetStromelysin-1
LigandBDBM50285574
Substrate/Competitorn/a
Meas. Tech.ChEBML_101950
Ki 110±n/a nM
Citation Sahoo, SPCaldwell, CGChapman, KTDurette, PLEsser, CKKopka, IEPolo, SASperow, KMNiedzwiecki, LMIzquierdo-Martin, MChang, BCHarrison, RKStein, RLMacCoss, MHagmann, WK Inhibition of matrix metalloproteinases by N-carboxyalkyl dipeptides: Enhanced potency and selectivity with substituted P1′ homophenylalanines Bioorg Med Chem Lett5:2441-2446 (1995)    Article
 
Stromelysin-1
Name:Stromelysin-1
Type:Enzyme
Mol. Mass.:53973.13
Organism:Homo sapiens (Human)
Description: P08254
Residue:477
BDBM50285574
NameBDBM50285574
Synonyms:(R)-2-((S)-1-((S)-4-methyl-1-oxo-1-(phenylamino)pentan-2-ylamino)-1-oxo-4-p-tolylbutan-2-ylamino)propanoic acid CHEMBL310834
TypeSmall organic molecule
Emp. Form.C26H35N3O4
Mol. Mass.453.5738
SMILESCC(C)C[C@H](NC(=O)[C@H](CCc1ccc(C)cc1)N[C@H](C)C(O)=O)C(=O)Nc1ccccc1