Reaction Details
Target72 kDa type IV collagenase
LigandBDBM50057090
Substrate/Competitorn/a
Meas. Tech.ChEBML_101914
Ki 3.5±n/a nM
Citation Sahoo, SPCaldwell, CGChapman, KTDurette, PLEsser, CKKopka, IEPolo, SASperow, KMNiedzwiecki, LMIzquierdo-Martin, MChang, BCHarrison, RKStein, RLMacCoss, MHagmann, WK Inhibition of matrix metalloproteinases by N-carboxyalkyl dipeptides: Enhanced potency and selectivity with substituted P1′ homophenylalanines Bioorg Med Chem Lett5:2441-2446 (1995)    Article
 
72 kDa type IV collagenase
Name:72 kDa type IV collagenase
Type:Enzyme
Mol. Mass.:73870.36
Organism:Homo sapiens (Human)
Description: P08253
Residue:660
BDBM50057090
NameBDBM50057090
Synonyms:(R)-2-((S)-1-((S)-4-methyl-1-oxo-1-(phenylamino)pentan-2-ylamino)-1-oxo-4-(4-propylphenyl)butan-2-ylamino)propanoic acid (R)-2-[(S)-1-(3-Methyl-1-phenylcarbamoyl-butylcarbamoyl)-3-(4-propyl-phenyl)-propylamino]-propionic acid | CHEMBL8474
TypeSmall organic molecule
Emp. Form.C28H39N3O4
Mol. Mass.481.627
SMILESCCCc1ccc(CC[C@H](N[C@H](C)C(O)=O)C(=O)N[C@@H](CC(C)C)C(=O)Nc2ccccc2)cc1