Reaction Details
TargetD(3) dopamine receptor
LigandBDBM50285652
Substrate/Competitorn/a
Meas. Tech.ChEMBL_58777 (CHEMBL666892)
Ki 5±n/a nM
Citation Wright, JDowning, DHeffner, TPugsley, TMacKenzie, RWise, L Discovery of selective dopamine D3 ligands: I. Dimeric 2-[4-(3-aminopropoxy)phenyl]benzimidazole antagonists Bioorg Med Chem Lett5:2541-2546 (1995)    Article
 
D(3) dopamine receptor
Name:D(3) dopamine receptor
Type:n/a
Mol. Mass.:44243.43
Organism:Homo sapiens (Human)
Description:n/a
Residue:400
BDBM50285652
NameBDBM50285652
Synonyms:(3-{4-[1-((E)-4-{2-[4-(3-Dipropylamino-propoxy)-phenyl]-benzoimidazol-1-yl}-but-2-enyl)-1H-benzoimidazol-2-yl]-phenoxy}-propyl)-dipropyl-amine | CHEMBL315137
TypeSmall organic molecule
Emp. Form.C48H62N6O2
Mol. Mass.755.0449
SMILESCCCN(CCC)CCCOc1ccc(cc1)-c1nc2ccccc2n1C\C=C\Cn1c(nc2ccccc12)-c1ccc(OCCCN(CCC)CCC)cc1