Reaction Details
TargetD(3) dopamine receptor
LigandBDBM50285668
Substrate/Competitorn/a
Meas. Tech.ChEMBL_58776 (CHEMBL666891)
Ki 1.7±n/a nM
Citation Wright, JHeffner, TPugsley, TMacKenzie, RWise, L Discovery of selective dopamine D3 ligands: II. 2-[4-[3-(4-aryl-1-piperazinyl)propoxy]phenyl]benzimidazole partial agonists Bioorg Med Chem Lett5:2547-2550 (1995)    Article
 
D(3) dopamine receptor
Name:D(3) dopamine receptor
Type:n/a
Mol. Mass.:44243.43
Organism:Homo sapiens (Human)
Description:n/a
Residue:400
BDBM50285668
NameBDBM50285668
Synonyms:2-(4-{3-[4-(2-Methoxy-phenyl)-piperazin-1-yl]-propoxy}-phenyl)-1H-benzoimidazole | CHEMBL313620
TypeSmall organic molecule
Emp. Form.C27H30N4O2
Mol. Mass.442.5527
SMILESCOc1ccccc1N1CCN(CCCOc2ccc(cc2)-c2nc3ccccc3[nH]2)CC1