Reaction Details
TargetCysteinyl leukotriene receptor 1
LigandBDBM50285678
Substrate/Competitorn/a
Meas. Tech.ChEMBL_99994 (CHEMBL710519)
IC50 0.38±n/a nM
Citation Labelle, MGareau, YDufresne, CLau, CKBelley, MJones, TRLeblanc, YMcAuliffe, MMcFarlane, CSMetters, KMOuimet, NPerrier, HRochette, CSawyer, NSlipetz, DXiang, YBWang, ZPickett, CBFord-Hutchinson, AWYoung, RN Discovery of L-740,515, a potent thienopyridine cysLT1 receptor (LTD4 receptor) antagonist Bioorg Med Chem Lett5:2551-2556 (1995)    Article
 
Cysteinyl leukotriene receptor 1
Name:Cysteinyl leukotriene receptor 1
Type:Enzyme Catalytic Domain
Mol. Mass.:38565.16
Organism:Homo sapiens (Human)
Description:Leukotriene Cysteinyl 1 CYSLTR1 HUMAN::Q9Y271
Residue:337
BDBM50285678
NameBDBM50285678
Synonyms:(1-{(R)-1-{3-[(E)-2-(2,3-Dichloro-thieno[3,2-b]pyridin-5-yl)-vinyl]-phenyl}-3-[4-(1-hydroxy-1-methyl-ethyl)-phenyl]-propylsulfanylmethyl}-cyclopropyl)-acetic acid | CHEMBL313187
TypeSmall organic molecule
Emp. Form.C33H33Cl2NO3S2
Mol. Mass.626.656
SMILESCC(C)(O)c1ccc(CC[C@@H](SCC2(CC(O)=O)CC2)c2cccc(\C=C\c3ccc4sc(Cl)c(Cl)c4n3)c2)cc1