Reaction Details
TargetGag-Pol polyprotein [489-587]
LigandBDBM50285699
Substrate/Competitorn/a
Meas. Tech.ChEMBL_79978 (CHEMBL874137)
Ki 12±n/a nM
Citation Randad, RSLubkowska, LBujacz, ANaik, RHGulnik, SVYu, BSilva, AMunshi, SLynch, TMClanton, DJBhat, TNErickson, JW Structure-based design of achiral anthranilamides as P2/P2′ surrogates for symmetry-based HIV protease inhibitors: design, synthesis, X-ray structure, enzyme inhibition and antiviral activity Bioorg Med Chem Lett5:2557-2562 (1995)    Article
 
Gag-Pol polyprotein [489-587]
Name:Gag-Pol polyprotein [489-587]
Type:Enzyme Subunit
Mol. Mass.:10781.16
Organism:Human immunodeficiency virus type 1
Description:P04585[489-587]
Residue:99
BDBM50285699
NameBDBM50285699
Synonyms:Anthranilamide derivative | CHEMBL87879
TypeSmall organic molecule
Emp. Form.C50H50N4O8
Mol. Mass.834.954
SMILESCc1cccc(C(=O)N[C@@H](Cc2ccccc2)[C@H](O)[C@H](O)[C@H](Cc2ccccc2)NC(=O)c2cccc(C)c2NC(=O)OCc2ccccc2)c1NC(=O)OCc1ccccc1