Reaction Details
TargetRetinoic acid receptor RXR-beta
LigandBDBM50285919
Substrate/Competitorn/a
Meas. Tech.ChEBML_197054
EC50 3±n/a nM
Citation Beard, RLColon, DFKlein, ESVorse, KAChandraratna, RA Differential RXR & RAR activity of stilbene retinoid analogs bearing thiazole and imidazole carboxylic acids Bioorg Med Chem Lett5:2729-2734 (1995)    Article
 
Retinoic acid receptor RXR-beta
Name:Retinoic acid receptor RXR-beta
Type:PROTEIN
Mol. Mass.:56932.89
Organism:Homo sapiens (Human)
Description:ChEMBL_39045
Residue:533
BDBM50285919
NameBDBM50285919
Synonyms:2-[(E)-2-(3,5,5,8,8-Pentamethyl-5,6,7,8-tetrahydro-naphthalen-2-yl)-propenyl]-thiazole-5-carboxylic acid | CHEMBL328481
TypeSmall organic molecule
Emp. Form.C22H27NO2S
Mol. Mass.369.52
SMILESC\C(=C/c1ncc(s1)C(O)=O)c1cc2c(cc1C)C(C)(C)CCC2(C)C