Reaction Details
TargetRetinoic acid receptor RXR-alpha
LigandBDBM50032220
Substrate/Competitorn/a
Meas. Tech.ChEBML_196628
EC50 35±n/a nM
Citation Beard, RLColon, DFKlein, ESVorse, KAChandraratna, RA Differential RXR & RAR activity of stilbene retinoid analogs bearing thiazole and imidazole carboxylic acids Bioorg Med Chem Lett5:2729-2734 (1995)    Article
 
Retinoic acid receptor RXR-alpha
Name:Retinoic acid receptor RXR-alpha
Type:PROTEIN
Mol. Mass.:50820.38
Organism:Homo sapiens (Human)
Description:ChEMBL_1456363
Residue:462
BDBM50032220
NameBDBM50032220
Synonyms:5-[(E)-2-(3,5,5,8,8-Pentamethyl-5,6,7,8-tetrahydro-naphthalen-2-yl)-propenyl]-thiophene-2-carboxylic acid | CHEMBL91718
TypeSmall organic molecule
Emp. Form.C23H28O2S
Mol. Mass.368.532
SMILESC\C(=C/c1ccc(s1)C(O)=O)c1cc2c(cc1C)C(C)(C)CCC2(C)C