Reaction Details
TargetGag-Pol polyprotein [489-587]
LigandBDBM50285964
Substrate/Competitorn/a
Meas. Tech.ChEBML_79955
IC50 0.500000±n/a nM
Citation Munroe, JEHornback, WJCampbell, JBOuellette, MAHatch, SDMuesing, MAWiskerchen, MABaxter, AJSu, KCampanale, K Ly316340: A potent HIV-1 protease inhibitor containing a high affinity octahydrothienopyridine hydroxyethylamine isostere Bioorg Med Chem Lett5:2885-2890 (1995)    Article
 
Gag-Pol polyprotein [489-587]
Name:Gag-Pol polyprotein [489-587]
Type:Enzyme Subunit
Mol. Mass.:10781.16
Organism:Human immunodeficiency virus type 1
Description:P04585[489-587]
Residue:99
BDBM50285964
NameBDBM50285964
Synonyms:(3aR,6S,7aS)-5-[(2R,3S)-2-Hydroxy-3-(3-hydroxy-2-methyl-benzoylamino)-4-phenyl-butyl]-octahydro-thieno[3,2-c]pyridine-6-carboxylic acid tert-butylamide | CHEMBL98096
TypeSmall organic molecule
Emp. Form.C30H41N3O4S
Mol. Mass.539.729
SMILESCc1c(O)cccc1C(=O)N[C@@H](Cc1ccccc1)[C@H](O)CN1C[C@H]2CCS[C@H]2C[C@H]1C(=O)NC(C)(C)C