Reaction Details
TargetGag-Pol polyprotein [489-587]
LigandBDBM519
Substrate/Competitorn/a
Meas. Tech.ChEBML_79955
IC50 1±n/a nM
Citation Munroe, JEHornback, WJCampbell, JBOuellette, MAHatch, SDMuesing, MAWiskerchen, MABaxter, AJSu, KCampanale, K Ly316340: A potent HIV-1 protease inhibitor containing a high affinity octahydrothienopyridine hydroxyethylamine isostere Bioorg Med Chem Lett5:2885-2890 (1995)    Article
 
Gag-Pol polyprotein [489-587]
Name:Gag-Pol polyprotein [489-587]
Type:Enzyme Subunit
Mol. Mass.:10781.16
Organism:Human immunodeficiency virus type 1
Description:P04585[489-587]
Residue:99
BDBM519
NameBDBM519
Synonyms:(2S)-N-[(2S,3R)-4-[(3S,4aS,8aS)-3-(tert-butylcarbamoyl)-decahydroisoquinolin-2-yl]-3-hydroxy-1-phenylbutan-2-yl]-2-(quinolin-2-ylformamido)butanediamide Fortovase Ro 31-8959 Saquinavir
TypeSmall organic molecule
Emp. Form.C38H50N6O5
Mol. Mass.670.8408
SMILESCC(C)(C)NC(=O)[C@@H]1C[C@@H]2CCCC[C@@H]2CN1C[C@@H](O)[C@H](Cc1ccccc1)NC(=O)[C@H](CC(N)=O)NC(=O)c1ccc2ccccc2n1