Reaction Details
TargetPlatelet-activating factor receptor
LigandBDBM50286013
Substrate/Competitorn/a
Meas. Tech.ChEMBL_155163 (CHEMBL761901)
Ki 68±n/a nM
Citation Davidsen, SKSummers, JBSweeny, DJHolms, JHAlbert, DHCarrera, GMTapang, PMagoc, TJConway, RGRhein, DA Synthesis of active metabolites of indole pyrrolothiazole paf antagonists Bioorg Med Chem Lett5:2909-2912 (1995)    Article
 
Platelet-activating factor receptor
Name:Platelet-activating factor receptor
Type:Enzyme Catalytic Domain
Mol. Mass.:39221.53
Organism:RAT
Description:PAF Platelet activating factor PTAFR RAT::P46002
Residue:341
BDBM50286013
NameBDBM50286013
Synonyms:(cis)-(2S,3R)-7-[1-Dimethylcarbamoyl-6-(4-fluoro-phenyl)-1H-indole-3-carbonyl]-2-hydroxy-3-pyridin-3-yl-1H-pyrrolo[1,2-c]thiazol-2-ium CHEMBL538366
TypeSmall organic molecule
Emp. Form.C29H23FN4O3S
Mol. Mass.526.581
SMILESCN(C)C(=O)n1cc(C(=O)c2ccn3[C@@H](c4cccnc4)S(=O)Cc23)c2ccc(cc12)-c1ccc(F)cc1