Reaction Details
TargetCholecystokinin receptor type A
LigandBDBM50286148
Substrate/Competitorn/a
Meas. Tech.ChEBML_49403
IC50 800±n/a nM
Citation Holladay, MWBennett, MJBai, HRalston, JWKerwin, JFStashko, MMiller, TRO'Neill, ABNadzan, AMBrioni, JLin, CW Amino acid-derived piperidides as novel CCKB ligands with anxiolytic-like properties Bioorg Med Chem Lett5:3057-3062 (1995)    Article
 
Cholecystokinin receptor type A
Name:Cholecystokinin receptor type A
Type:n/a
Mol. Mass.:48229.77
Organism:Cavia porcellus
Description:n/a
Residue:430
BDBM50286148
NameBDBM50286148
Synonyms:1-[(S)-2-(4-Benzoyl-piperidin-1-yl)-2-oxo-1-phenylmethanesulfinylmethyl-ethyl]-3-m-tolyl-urea | CHEMBL105132
TypeSmall organic molecule
Emp. Form.C30H33N3O4S
Mol. Mass.531.666
SMILESCc1cccc(NC(=O)N[C@H](CS(=O)Cc2ccccc2)C(=O)N2CCC(CC2)C(=O)c2ccccc2)c1